Cannot read configuration file due to insufficient permissions

I've recently encountered an error trying to host my asp.net site with IIS. I have found a solution that many swear by. Solution: Add IIS_IUSRS with Read permission on files in the...

How to see the compilation platform of a static library file

I had a static library file. How can I see whether it is compiled in i386 or in arm platform. Thanks.

java compiled classes contain dollar signs

I've been using Eclipse as my development IDE. I also use it to export my application into a .jar file. When I look at my classes in the .jar file, a few of my classes contain the name of that...

android ndk error "no such file or directory"?

I have some header files in include folder. Here is the Android.mk file contents. include $(call all-subdir-makefiles) LOCAL_PATH := $(call my-dir) include $(CLEAR_VARS) LOCAL_MODULE :=...

Failed to build gem native extensions of jquery-rails after installing Python 2.7

Using: Ruby: 2.1.1 Rails: 4 OS: Debian Wheezy Short problem story: I installed Python 2.7 and now my bundle install won't succeed anymore. It got stuck at: Using jquery-rails...

How to avoid Query Plan re-compilation when using IEnumerable.Contains in Entity Framework LINQ queries?

I have the following LINQ query executed using Entity Framework (v6.1.1): private IList<Customer> GetFullCustomers(IEnumerable<int> customersIds) { IQueryable<Customer> fullCustomerQuery =...

Azure Website ASP.net WebPages "The page cannot be displayed because an internal server error has occurred."

I've developed an application in WebPages and im hosting the website on Azure. Its giving me the error "The page cannot be displayed because an internal server error has occurred." I'm not sure...

IntelliJ source code editor shows false compilation errors

I have a problem with the following odd behaviour of the IntelliJ IDEA development environment (version 14) with scala: After I reset the (global) scala SDK from a 2.11 version to version 2.10.4...

cmake error : opencv2/opencv.hpp:opencv2/opencv.hpp:No such file or directory

I am compiling opencv programs with cmake. The code is as follows: DisplayImage.cpp: #include <stdio.h> #include <opencv2/opencv.hpp> using namespace cv; int main(int argc, char** argv ) { ...

Can't install thrift gem on OS X El Capitan

Trying to install thift gem after OSX El Capitan upgrade: $ gem install thrift Building native extensions. This could take a while... ERROR: Error installing thrift: ERROR:...

Property 'X' is private and only accessible within class 'xyzComponent'

I'm trying to build angular2 application for production for that I'm following this blog. After my ngc successful compilation when the tsc compilation takes place it generates below error shown in...

implicit declaration of function 'write' (unistd included)

I wrote a function that prints text on standard output. At compilation (using gcc exemple.c), i get a warning : implicit declaration of function 'write'. Here is an exemple : exemple.c : #include...

"If constexpr" in C++17 does not work in a non-templated function

I tried to play with the C++17 standard. I tried to use one of the features of C++17 if constexpr. And I had a problem... Please take a look at the following code. This compiles without errors. In...

In which access control context are concepts evaluated?

This question is a follow up to this one [temp.concept]/5 says: A concept is not instantiated ([temp.spec]). [ Note: An id-expression that denotes a concept specialization is evaluated as an...

How to fix "FATAL ERROR: Ineffective mark-compacts near heap limit Allocation failed - JavaScript heap out of memory" error

I'm trying to deploy a reactjs application to heroku. While compiling assets, the build fails and produces this error: -----> Ruby app detected -----> Compiling Ruby/Rails -----> Using Ruby...

Are there any options other than using #define for conditional compilation?

I want to use conditional compilation for testing different properties of my code; however, I don't want to pollute the global namespace. Would someone be kind enough to let me know if there is a...

Empty page after installing Angular Playground into an Ionic 4 project

I have a basic Ionic 4 project created with Ionic CLI. I've then added and ran Angular Playground with the following command: ng add angular-playground After that I have fixed the path for the...

Failed to install gcc on Python-3.7-alpine docker container

I am trying to set up a Python docker container, when I run the command "docker-compose up" to build the Dockerfile it throws me this error message below. The docker file was successfully built...

A 4-bit counter D flip flop with + 1 logic

I am trying to implement this D flip-flop counter with + 1 logic through Verilog. Bu,t I'm getting a lot of error codes about multiple constant drivers for net. Can anyone give me a hand? Here...

Generate code for classes with an attribute

I have the following setup : public class CustomAttribute : Attribute { [...] public CustomAttribute(Type type) { [...] } } [Custom(typeof(Class2))] public class Class1 { ...

EXC_BAD_ACCESS on VNSequenceRequestHandler

The following code uses the Vision and AVFoundation frameworks to enable face tracking on the built-in camera on macOS. In some circumstances the code crashes due to EXC_BAD_ACCESS (code=2) on a...

Property 'userId' does not exist on type 'Session & Partial<SessionData>'

I am using express-session in my project, but after update express-session to 1.17.1, tsc compilation getting some errors: After add type merging like this: The errors in the vscode editor are...

ERROR: Failed building wheel for psycopg2 (Ubuntu 20.04 + Python 3.8.5 + venv)

Greetings wisdom from Stackoverflow! I'm having issues building wheel for psycopg2 thru pip install -r requirements.txt. I'm on ubuntu 20.04 + python 3.8.5 + venv. This is my...

error TS6231: Could not resolve the path '' with the extensions: '.ts', '.tsx', '.d.ts'

I'm working on firebase functions with typescript and this error appears in the console while running tsc . -watch: [12:19:41 PM] Starting compilation in watch mode... error TS6231: Could not...

Pytorch throws CUDA runtime error on WSL2

I install Nvidia Windows Driver and CUDA according to this article. After the installation of Nvidia Windows Driver, I’ve checked CUDA version by running...

Angular Error, Windows Script Host Error: Invalid character Code:800A03F6 Source:Microsoft JScript compilation error

I'm having an issue with Powershell and CMD, when I try to execute Angular CLI commands in CMD like "ng --version" & "ng new projectName" I get an error Windows Script Host Error: Invalid...

cytoolz/dicttoolz.c:19:10: fatal error: Python.h: No such file or directory

cytoolz/dicttoolz.c:19:10: fatal error: Python.h: No such file or directory 19 | #include "Python.h" | ^~~~~~~~~~ compilation terminated. error: command 'gcc' failed...

The injectable 'PlatformLocation' needs to be compiled using the JIT compiler, but '@angular/compiler' is not available

My Angular application is served via Node 16.13.0. After updating to Angular 13, I'm receiving the following error: JIT compilation failed for injectable [class...

Verify/Publish Smart Contract on Etherscan Rinkeby

I am attempting to Verify and Publish a smart contract that I have deployed to the rinkeby network using hardhat and hardhat-etherscan. When I am running the verify script I am getting an error. I...

Problem with memory allocation in Julia code

I used a function in Python/Numpy to solve a problem in combinatorial game theory. import numpy as np from time import time def problem(c): start = time() N = np.array([0, 0]) U =...