Colourbox and timthumb.php

I am having issues with timthumb.php and colourbox lightbox, timthumb is working great on everything else but when i try to load a larger image i get the following The images just shows as code...

Can't figure out which dependencies package spynner 1.11 python 2.7.2 module needs on Ubuntu 11.10

I try to install dependencies of spynner python module, but I get : $ python -c 'import spynner' Traceback (most recent call last): File "<string>", line 1, in <module> File...

How to get Qt 5.0 working with Qt Creator 2.5.2?

I have just downloaded the source code for Qt 5.0 and compiled it on Ubuntu 12.10 64-bit. Running sudo make install seems to have copied the files to /usr/local/Qt-5.0.0: So far so good. But when...

Write a sed command to extract words

There is a file from which i want to get libqt4-dbus libqt4-network libqt4-script libqt4-test libqt4-xml libqtcore4 libqt4-designer libqt4-opengl libqt4-svg libqtgui4...

Setting/Installing up OpenCV 2.4.6.1+ on Ubuntu 12.04.02

I had previously used OpenCV 2.4.5 with some certain configs and packages on Ubuntu 12.04.1 but had issues upgrading to OpenCV 2.4.6.1 on Ubuntu 12.04.2 I would like to share some ideas (a...

can't install QT4 on linux Mint

I am trying to compile vpnshrew with CMAKE on linux mint. However QT4 is missing and I have already tried everything with no success. The starting line it's this dependency error: $ sudo apt-get...

unmet dependencies with QT

I can't install any more packages in my Ubuntu 12. I tried apt-get install -f, and many others tricks like this, but no progress in finding a solution. Here is the broken packages belonging to...

Is Vagrant rolling back changes on me?

We ran into some Vagrant issues recently and I've been trying to fix them. I'm at a lost now though as when I run a vagrant destroy and then vagrant up the provisioning will fail near the end of...

CI for Qt app: build with different Qt versions

I use Travis-CI for continuous integration for my simple Qt app. My .travis.yml file looks like this (based on this gist): language: cpp before_install: - sudo add-apt-repository --yes...

Mint17.2 install py2exe

I tried downloading the .exe files (problem: can't find a version 2.7 of python on computer + can't add the directory) I tried using the: pip install...

LibQt4-core has unmet dependencies

I'm trying to install libqt4-core, but it seems that for the dependencies, I have more recent versions than are compatible with this package. When I use sudo apt-get install libqt4-core my output...

How to fix error: command 'x86_64-linux-gnu-gcc' failed with exit status 1

I'm trying to install odoo on a fresh installation of Linux on a VirtualBox machine. I have entered in the commands found here as is: Odoo Development Read the Docs. The following command is what...

Where can I find the QWebPage and pymongo in python3.4?

I'm working on some code that requires a number of packages from python qt 5. I get a missing package error upon importing the QWebPage module: from PyQt5.Qt import QWebPage,...

Why PyQt4 DialogBox OpenFileName freeze until other threads have finished under Linux

Under Linux, the QFileDialog.getOpenFileNames() freeze in a script who have no other GUI until other process have done, even if it runs in a separate thread or Qthread. I've tested under Ubuntu...

Using gitlab ci with docker compose leaves me with container generated folders gitlab can't remove

I'm trying to set up gitlab ci using the method documented here and testing a rails 4 app with it. The problem I'm having is that the test will run once and build the image and containers, but...

Unmet dependencies? Broken packages held?

I am trying to get a vpn up and running and am doing so through the shrew soft client. When I go to run the command: sudo apt-get install libqt4-core libqt4-dev libqt4-gui qt4-dev-tools I get...

TA-Lib Install Error

I am trying to install TA-Lib on Debian Jessie using pip. However I am encountering the following error: #include "ta-lib/ta_defs.h" ^ compilation terminated. error:...

fatal: ambiguous argument 'v': unknown revision or path not in the working tree in git

i am building my binaries using gitian-build for my own blockchain(template from peershare) that is run on my localhost. when i exwcute the command git pull for the gitian-builder it gives the...

Rails generate: "Expected string default value for '--helper'; got true (boolean)"

Edited 12-21-16: Upon using rails generate or destroy, errors of the type: Expected string default value for '--jbuilder'; got true (boolean) Expected string default value for '--helper'; got true...

Installing Scrapy throws exceptions again and again

I've tried to install Scrapy the usual way: Python 2, pip, pip install Scrapy I read that Python3, Windows10 and 64bit are not so good for Scrapy so I've installed 32bit Ubuntu to Oracle...

Error while installing sentry on server python

I looked up all over the google, installed many packages. sudo apt-get install build-essential autoconf libtool pkg-config python-opengl python-imaging python-pyrex python-pyside.qtopengl...

Broken apt dependency tree

I was upgrading Ubuntu 16.04 to 17.04, when some packaged failed to upgrade. This left the apt dependency in a broken state. I tried some other answers online, but I am afraid this only...

Deleting build dependency packages in Debian 9

I have a script to compile several programs of a LEMP server (nginx, php, openssl, etc ...), I would like to know what packages I could delete after finishing with the compilations. I leave the...

Installing tsne in Google Colab notebook: error: command 'x86_64-linux-gnu-gcc' failed with exit status 1

I am trying to install the tsne library in a Google Colab notebook. Based on other questions, I have tried installing the following to no avail: !apt-get install libblas-dev libatlas-base-dev...

Bash redirect stderr to file after for loop

I have the following script that checks for installed/uninstalled packages: #!/bin/bash DEPENDENCIES="build-essential pkg-config qt4-qmake libqt4-dev libavformat-dev libavcodec-dev" for dep in...

Assets Precompile with Docker on AWS Elastic Beanstalk

I'm running a rails (4.2.10) application on Docker running on 64bit Amazon Linux/2.12.6. The application is running successfully, however, the asset pipeline is not. Oddly, I'm not receiving any...

Rails & Docker: configure bundler to run bundle install in a docker build for Rails.4.2.6?

I am having so much trouble with docker. It seems to be a pattern. I have a dockerfile which installs Node.js and Yarn from source repositories fine. I install ruby from the get-apt repositories...

Apache Airflow : airflow initdb results in "ImportError: No module named json"

On Ubuntu 16.04 with Python 2.7 default version, I am trying to install Apache airflow but ran into several issues and currently I see on apache initdb Traceback (most recent call last): File...

How to install Qt4 and Qt5 alongside each other Ubuntu 1804

I have some software packages that depend on qt4. I installed Qt 4 just for those packages with the command sudo apt install qt4-default. I want to install qt5-default, but when I run the command...