Changing cookie JSESSIONID name

I have a requirement of having to run multiple tomcat server in single physical box. While accessing these from a browser, when user switches between the applications, it results in logging out...

WAS 6.1 java.lang.VerifyError: class loading constraint violated

The environment is WAS 6.1 on Linux, deploying a webapp that uses classes from xercesImpl.jar. Due to company policy restrictions, the app must be deployed with settings: Class Loader Order ...

Java Socket permission : applet isn't initialized

Following is the part of my error. Because of this error my applet isn't initialized. The following code is part of the init() method: Socket sock; try { sock = new...

How to insert json array into mysql database

Hi I'm trying to insert the json array into my MySQL database. I'm passing the data form my iphone there i have converted the data into json format and I'm passing the data to my server using the...

nodejs + sequelize :: include where required false

i have the following hierarchy of objects: user parent (hasOne) children (hasMany) once i have a user object, im attempting to load the associated parent object along with some of its children....

How to resolve the error 'The name of the class AccordionGroup should end with the suffix Component'

I got an error in angular2 and typescript.The name of the class AccordionGroup should end with the suffix Component.Its not stop the execution but it shows the error.I have implemented the...

How to bind default value in mat-radio-group angular reactive forms

In my case it needs to active option 01 as default selection. It is working with checked=true property, but value is not binding with the formControlName="options", it is binding when user select...

ASP.NET Core 2 web application isn't loading user secrets when debugging IIS website

Note: this issue has now been resolved - see my Update 3 below for the solution. I have an ASP.NET Core 2 web app which needs to connect to a SQL Server database. As per my Update 2 below I'm...

TypeError: User.findByIdAndUpdate is not a function

Answer this fixed: mongoose.model('User').findByIdAndUpdate(... although it doesn't seem right. Should be another way to require this. Will figure out. I have a signup form, where user can check a...

Docker Node Alpine Image Build Fails on node-gyp

I'm attempting to Dockerize a Vue.js application. I'm using the node:10.15-alpine Docker image as a base. The image build fails with the following error: gyp ERR! configure error gyp ERR! stack...

Error Retrieving substring from larger text source in Protractor

I am trying to extract a URL from a registration email in my end-to-end test for Protractor, but I am getting errors trying to parse the larger string. The error I am getting is: Failures: 1)...

VSCode showing "cannot find module" TS error for .vue import while compiling doesn't

Simply put, vscode is showing this error in a module: Cannot find module '@/components/SidebarToggleIcon' But no such error shows up during compilation. This is a VueJS project and...

javax.net.ssl.SSLHandshakeException: No available authentication scheme

A google reveals a bug in jdk11.0.2 but I upgraded to jdk11.0.3 and this still exists for me. Steps to reproduce git clone https://github.com/deanhiller/webpieces.git add the line...

Fix GoLand not finding module dependencies ("cannot resolve...")?

I have installed my project's Go module dependencies with go build. But GoLand is telling me it cannot resolve any of these dependencies. How can I get GoLand to find the Go module dependencies?

pivot_wider issue "Values in `values_from` are not uniquely identified; output will contain list-cols"

My data looks like this: # A tibble: 6 x 4 name val time x1 <chr> <dbl> <date> <dbl> 1 C Farolillo 7 2016-04-20 51.5 2 C Farolillo 3 2016-04-21 56.3 3 C...

NavigateByUrl doesn't work from onTokenReceived using angular-oauth2-oidc

I'm using angular-oauth2-oidc package, I using implicit flow, and I can't migrate (at the moment) to code flow. I would like to navigate to original url when the flow is ended, I have using...

Javascript use single await in ternary operator

I have a situation I want to use await in a ternary operator. I want to set a value to either a literal value or the resolve value of a promise, depending on a condition. Hopefully the code below...

How to resolve Node.js Promise in N-Api Addon C

My main problem is to call the asynchronous function from Node.js in addon and get the returned value. I am trying to resolve the promise returned from the called JS function. index.js const addon...

I am creating a new page in ionic 5 but it is giving this error **Could not find an NgModule**

When i run ionic g page pages/first Complete error line: Could not find an NgModule. Use the skip-import option to skip importing in NgModule. [ERROR] Could not generate page And When I run ionic...

schematool: command not found

I am trying to install Hive on my Ubuntu 19.10 machine . I am using this doc https://phoenixnap.com/kb/install-hive-on-ubuntu. As mentioned in step 6, where I am trying to initiate Derby Database,...

Caused by: java.lang.IllegalArgumentException: Could not resolve placeholder 'some.other.property' in value "${some.other.property}"

I am new to Spring technology and this issue has been bugging me for hours. My spring cloud config client isn't able to read properties from the config server because I am getting an...

Hypercorn Name does not resolve in Docker

I am trying to test my Quart application (pager) that connects to a MySQL instance in a docker container called master-db, but after a few retries I get a hypercorn error: pager | Traceback...

Manifest merger failed targeting Android 12

Using Android Studio 4.2.1, after changing sdk target to Android 12 in my build.gradle file, I am getting a Manifest merger failed with multiple errors, see logs error. The errors shown in the...

error NU1100: Unable to resolve 'Microsoft.AspNetCore.SpaServices.Extensions

I was trying to build a react app using Dotnet. I have installed dotnet but still getting this error. I have installed dotnet 5 and dotnet core 3.5. I have given the necessary images regarding the...

Problem trying to display custom error pages with Spring Boot

I'm maintaining a Spring Boot Application that uses Swagger to define Rest web services and uses Maven for dependency management. It uses an application.yml file for properties. By default, when...

How to resolve 'getUserByAccount is not a function' in next-auth?

I've updated Nextjs to it's newest version and also updated next-auth and the prisma adapter as specified by the docs. However, when I try to authenticate in the app with signIn I get the...

How to use Private route in [email protected]

I want to use private route with react-router-dom v6, while i am trying to apply a condition for auth. In App.js <Route path='/dashboard' element= { <PrivateRoute><Abc /></PrivateRoute>}/> In a...

"Gatsby-plugin-sharp wasn't setup correctly in gatsby-config.js. Make sure you add it to the plugins array."

The most frustrating part is that I had this working earlier then somehow broke it, but I'm using gatsby-plugin-sharp and gatsby-plugin-image to add a photo to my homepage and seeing this...

Web3 Issue : React Application not compiling

I am facing issue with React application while compilation. Please find the issue below and screenshot. ERROR in ./node_modules/web3-providers-http/lib/index.js 30:11-26 Module not found: Error:...

angular 13: Module not found: Error: Can't resolve 'rxjs/operators'

I have upgraded my angular to angular 13. when I run to build SSR it gives me following error. ERROR in ./node_modules/@angular/common/fesm2015/http.mjs 12:0-56 Module not found: Error: Can't...