git pull fails "unable to resolve reference" "unable to update local ref"

Using git 1.6.4.2, when I tried a git pull I get this error: error: unable to resolve reference refs/remotes/origin/LT558-optimize-sql: No such file or directory From...

duplicate entry '0' for key 1 in mysql

I had a table field with datatype as 'smallint' (primary key) and it was auto_increment. It was working fine. After a long time, I got the error duplicate entry '32676' for key 1. So I updated...

git rebase -i: I only want the last commit

I have been working on a branch: C1--D1--E1 branch / A--B--C--D--E--F master On branch using "git rebase -i master" in a small test repo, I am able to get to here: ...

pom.xml shows multiple annotations errors in Eclipse

I can build the project from command line, but when I import it to Eclipse I get following error in pom.xml: Multiple annotations found at this line: - Plugin execution not covered by lifecycle...

How do I resolve `The following packages have unmet dependencies`

I was using this script to install basic software, but had to interrupt because of slow internet speed. Now when I hit $ sudo apt-get install npm , I get following error [email protected]:~$...

Spring Mvc Java Could not resolve view with name 'home' in servlet with name 'dispatcher'

I have problem with my first app. I try to solve this for several hours. Any idea?? HTTP Status 500 – Internal Server Error Type Exception Report Message Could not resolve view with name 'home'...

AttributeError: 'generator' object has no attribute 'to_sql' While creating datframe using generator

I am trying to create a datafrmae from fixedwidth file and load into postgresql database. My input file is very huge (~16GB) and 20Million records. So if i create dataframe it is consuming most of...

Rollup Won't Bundle Proptypes Dependency

I'm trying to build a component library of react components. I'd like to keep my prop-types in the library as documentation rather than remove them at build time. The problem is that rollup...

SwiftUI @State var initialization issue

I would like to initialise the value of a @State var in SwiftUI through the init() method of a Struct, so it can take the proper text from a prepared dictionary for manipulation purposes in a...

Create Readable JS from Typescript

I want my compiled JS code to be readable (similar as if I had written it), so it's easier to debug but the typescript compiler makes several changes which I'm hoping I can turn off. For...

create-react-app webpack configuration file

I have created a new react app using npx create-react-app and now I want to integrate a webpack.config.js file. I know I don't have to but it is a necessary step for an assignment. I have tried...

Module not found: Can't resolve 'google-maps-react' in 'C:\Users\USUARIO

I am trying to create a project in react that shows a google map with different locations. I used: $ npm install --save google-map-react from this very simple tutorial that I found online:...

Testing useSubscription apollo hooks with react

Testing the useSubscription hook I'm finding a bit difficult, since the method is omitted/not documented on the Apollo docs (at time of writing). Presumably, it should be mocked using the...

'NoneType' object is not iterable for collocation function

I am new to NLTK and trying to return the collocation output. I am getting the output and along with it, I am getting none as well. Below is my code, input and output. import nltk from nltk.corpus...

Material-table - if no data show message

I am using material-table https://material-table.com/#/docs/get-started. However I can't seem to find any information about showing a default message if no data is returned? I am wondering if...

Powershell install - No match was found for the specified search criteria and module name

I am having a difficult time installing/updating my powershell modules. I noticed this when I tried installing DBA Tools moudle. Reference links are https://dbatools.io/download/ and...

How to calculate age from birth date in pyspark?

I am calculating age from birth date in pyspark : def run(first): out = spark.sql(""" SELECT p.birth_date, FROM table1 p LEFT JOIN table2 a USING(id) ...

SwiftUI: How to ignore taps on background when menu is open?

I am currently struggling to resolve a SwiftUI issue: In a very abstract way, this is how the code of my application looks like (not the actual code to simply things for the discussion...

React Native build failing Could not HEAD /android-jsc/maven-metadata.xml'

I'm trying to build my react native app which has been working for weeks, but now I'm getting the following error: FAILURE: Build failed with an exception. * What went wrong: Execution failed for...

eslint / typescript: Unable to resolve path to module

My .eslintrc.json is: { "env": { "browser": true, "commonjs": true, "es6": true, "node": true, "jest": true }, "parserOptions": { ...

Unable to load Maven meta-data from https://jcenter.bintray.com/org/webkit/android-jsc/maven-metadata.xml Issue in react native

FAILURE: Build failed with an exception. What went wrong: Could not determine the dependencies of task ':app:lintVitalRelease'. Could not resolve all artifacts for configuration...

EFS CSI Driver mounting

Trying to configure EFS CSI driver configuration in EKS cluster with dynamic provisioning, i followed https://docs.aws.amazon.com/eks/latest/userguide/efs-csi.html this documentation but still not...

Why I am getting "Not Implemented Error: Database objects do not implement truth value testing or bool()." while running makemigration cmd in django

I am trying to connect Django with MongoDB using Djongo. I have changed the Database parameter but I am getting this error Not Implemented Error: Database objects do not implement truth value...

Find the number of paired letter between two string

I have two files that should be read. Each line in files contains strings. I just try to find the number of paired character at the same position into the strings. For example my first file like...

My flutter Android build broke all sudden with a gradle error, with no changes to the gradle configuration on my part

Out of the blue, I started getting the following build error when building my flutter app android version. The build was working fine, then all of a sudden, this error started occuring. I have not...

Angular 8 ERROR Error: Unable to find context associated with [object HTMLDivElement]

Just another day in the office, right? What once worked is no longer working. Yay! I am supporting an Angular 8 web application and attempting to kickstart localhost:4200. That said, the following...

TypeError: MiniCssExtractPlugin is not a constructor

[webpack-cli] TypeError: MiniCssExtractPlugin is not a constructor at module.exports (/home/andrey/smartadmin-app/webpack.config.js:70:9) at loadConfigByPath...

Start React Native : Error 502 from maven-metadata.xml

When I execute npx react-native run-android I have a 502 error that does not allow me to start my project. I have read these recents topics : "React Native: Android "Received status code 502 from...

Task :app:mergeDebugAssets FAILED when I try to run npx react-native run-android

I'm working on an android app on react-native using vscode and a physical android device and it keeps showing the error below while trying to build using npx react-native run-android. Task...